Home > Failed With > Usr/bin/make Failed With Exit Code 2

Usr/bin/make Failed With Exit Code 2

Contents

command "/usr/local/bin/node" "/usr/local/lib/node_modules/npm/node_modules/node-gyp/bin/node-gyp.js" "rebuild" gyp ERR! You can get their info via: npm ERR! I like Serena, Feb 3, 2012 Feb 5, 2012 #8 Monique Staff Emeritus Science Advisor Gold Member I like Serena said: ↑ Let me see if I understand the situation correctly. stack at Process.ChildProcess._handle.onexit (internal/child_process.js:200:12) gyp ERR! weblink

Thanks! Tell the author that this fails on your system: npm ERR! Hope this solves the error. ---- Great! npm ERR! http://stackoverflow.com/questions/26486283/command-usr-bin-codesign-failed-with-exit-code-1-resource-rules-has-been-depr

No Identity Found Command /usr/bin/codesign Failed With Exit Code 1 Xcode 7

Browse other questions tagged xcode6 or ask your own question. Is the use of username/password in a mobile app needed? Reload to refresh your session. Is there any way to take stable Long exposure photos without using Tripod?

Ultimate Australian Canal What does the expression 'seven for seven thirty ' mean? cwd /usr/local/lib/node_modules/node-inspector/node_modules/v8-profiler gyp ERR! So perhaps something inside of the make file is failing? Error Make Failed Sign in to comment Contact GitHub API Training Shop Blog About © 2017 GitHub, Inc.

Thank you! Can you find a reference in the Makefile to VTK.xcodeproj? npm owner ls node-curl npm ERR! npm ERR!

cwd /home/dipesh/Documents/Projects/voym/node_modules/node-curl gyp ERR! Node-gyp Rebuild Failed Ubuntu jimmygle commented Apr 28, 2015 Looks like maybe g++ isn't installed? Personal Open source Business Explore Sign up Sign in Pricing Blog Support Search GitHub This repository Watch 275 Star 10,877 Fork 694 node-inspector/node-inspector Code Issues 202 Pull requests 33 Projects Monique, Feb 3, 2012 Feb 3, 2012 #7 I like Serena Homework Helper Let me see if I understand the situation correctly.

  • node-gyp -v v3.4.0 gyp ERR!
  • stack at ChildProcess.onExit (/usr/lib/node_modules/npm/node_modules/node-gyp/lib/build.js:267:23) gyp ERR!
  • This is most likely a problem with the kerberos package, npm ERR!
  • Do you have a working Xcode?

Xcode /usr/bin/make Failed With Exit Code 2

Please include the following file with any support request: npm ERR! /Users/tkarpenko/****/npm-debug.log ../node_modules/nan/nan.h:1933:15: warning: 'SetAccessor' is deprecated [-Wdeprecated-declarations] return obj->SetAccessor( ^ /Users/tkarpenko/.node-gyp/7.1.0/include/node/v8.h:2761:22: note: 'SetAccessor' has been explicitly marked deprecated here bool npm ERR! No Identity Found Command /usr/bin/codesign Failed With Exit Code 1 Xcode 7 setenv JAVA_USE_DEPENDENCIES YES setenv JAVA_ZIP_FLAGS -urg setenv KEEP_PRIVATE_EXTERNS NO setenv LD_GENERATE_MAP_FILE NO setenv LD_MAP_FILE_PATH "/Users/julianliebl/Dev/Toony/ToonyBuild/ios/build/Toony.build/Release-iphoneos/Build Haxe.build/-LinkMap--.txt" setenv LD_NO_PIE NO setenv LEGACY_DEVELOPER_DIR /Applications/Xcode.app/Contents/PlugIns/Xcode3Core.ideplugin/Contents/SharedSupport/Developer setenv LINKER_DISPLAYS_MANGLED_NAMES NO setenv LINK_WITH_STANDARD_LIBRARIES YES setenv LOCAL_ADMIN_APPS_DIR /Applications/Utilities Npm `make` Failed With Exit Code: 2 node v7.1.0 npm ERR!

I like Serena, Feb 5, 2012 (Want to reply to this thread? http://qaisoftware.com/failed-with/command-developer-usr-bin-ibtool-failed-with-exit-code-255.html Posted on August 17, 2012 at 9:56 AM jujulian1987 Total Posts: 121 Joined: September 6, 2011 Re: Help with ios build error on ML: .../usr/bin/make failed with exit code 11 Yes Version info: gcc: 4.9.2 g++: 4.8.4 make: 3.81 node: 4.0.0 npm: 3.3.6 node-gyp: 3.0.3 ninja4826 closed this Oct 29, 2015 Sign up for free to join this conversation on GitHub. Build failed for Build Haxe. Resource Fork, Finder Information, Or Similar Detritus Not Allowed

Now I ran into the following error a… Community (Archived) » Programming with Haxe » [SOLVED] Help with ios build error on ML: .../usr/bin/make failed with exit code 11 Viewing 1 That's it Did you carefully monitor the build process and check for warnings or errors? What happens if you go to "/Export/(Project Name)/haxe" and run "make" manually? check over here node -v v7.1.0 gyp ERR!

Does anyone have a clue what could be the cause? Node-gyp Rebuild Fails Reload to refresh your session. Everything else (flash, mac, webos and android) is fine.

stack at ChildProcess.emit (events.js:98:17) gyp ERR!

TeXForm handling of derivative higher than two Bash regex test not working How do you express any radical root of a number? Generalization of winding number to higher dimensions Which was the last major war in which horse mounted cavalry actually participated in active fighting? npm ERR! Make: G++: Command Not Found Reload to refresh your session.

Reinstall solved the issue as expected. npm ERR! System Linux 3.13.0-49-generic npm ERR! http://qaisoftware.com/failed-with/command-developer-usr-bin-gcc-4-2-failed-with-exit-code-1.html code ELIFECYCLE npm ERR!

This is most likely a problem with the node-curl package, not with npm itself. stack at ChildProcess.onExit (/usr/local/lib/node_modules/npm/node_modules/node-gyp/lib/build.js:276:23) gyp ERR! Digital Camera Buyer’s Guide: DSLR The Schwarzschild Geometry: Part 1 Using the Fourier Series To Find Some Interesting Sums Intermediate Astrophotography Fake News and Science Reporting Fabry-Perot and Michelson Interferometry: A United States Copyright © Apple Inc.

stack Error: `make` failed with exit code: 2 gyp ERR! Exit status 1 npm ERR! code ELIFECYCLE npm ERR! not ok Failed to execute '/usr/local/bin/node /usr/local/lib/node_modules/npm/node_modules/node-gyp/bin/node-gyp.js build --fallback-to-build --module=/usr/local/lib/node_modules/node-inspector/node_modules/v8-profiler/build/profiler/v5.3.2/node-v46-darwin-x64/profiler.node --module_name=profiler --module_path=/usr/local/lib/node_modules/node-inspector/node_modules/v8-profiler/build/profiler/v5.3.2/node-v46-darwin-x64' (1) npm ERR!

stack at Process.ChildProcess._handle.onexit (internal/child_process.js:215:12) gyp ERR! There is likely additional logging output above. Is it a project you downloaded and are building from source? npm bugs libxmljs npm ERR!

Sign in to comment Contact GitHub API Training Shop Blog About © 2017 GitHub, Inc. Thought of sharing it here, if it helps some one. @funkyLover did you have to upgrade python by any chance? cwd /home/dipesh/Documents/Projects/voym npm ERR! not ok kalch commented Nov 12, 2016 Me too :-( Sign up for free to join this conversation on GitHub.

gyp ERR! Failed at the [email protected] install script 'node-gyp rebuild'. Posted on August 7, 2012 at 12:18 PM jujulian1987 Total Posts: 121 Joined: September 6, 2011 Re: Help with ios build error on ML: .../usr/bin/make failed with exit code 11 Okay Log in with Facebook Log in with Twitter Your name or email address: Do you already have an account?

The Problem seems to be with xCode 4.4. Personal Open source Business Explore Sign up Sign in Pricing Blog Support Search GitHub This repository Watch 8 Star 59 Fork 31 christkv/kerberos Code Issues 3 Pull requests 0 Projects Posted on August 17, 2012 at 10:35 AM singmajesty Total Posts: 2819 Joined: August 25, 2011 Re: Help with ios build error on ML: .../usr/bin/make failed with exit code 11 Does not with npm itself.