Home > Return Code > Return Code Is 401 Maven Deploy

Return Code Is 401 Maven Deploy

Contents

Note: I have uploaded Releases repositories using GUI, but snapshot repositories doesn't have option to upload in GUI. Return code: 4052Unable to find artifact from artifactory1Maven http.authentication.preemptive against Artifactory1Could not find artifact junit:junit:jar:4.12 in central0Artifactory maven login failed Failed to transfer file Return code is 401, ReasonPhrase Unauthorized Hot Thanks..!! asked 3 years ago viewed 5432 times active 3 years ago Related 2How to manage artifactory / maven artifact using different profiles1Artifactory is not caching the maven-metadata.xml file0How to clean versioned http://qaisoftware.com/return-code/nexus-maven-deploy-return-code-is-401.html

If the server is using https but the URL in your POM is http, you might get 401 as well. I have seen instances where it was one one account's .m2 directory and the person was using another account to do the compile. Support Submit a request Sign in Sonatype Support Nexus Repository Manager 2 Troubleshooting Troubleshooting Artifact Deployment Failures Rich Seddon Created: June 26, 2013 14:52 - Updated: August 06, 2016 14:45 Follow Return code is: 401, ReasonPhrase: Unauthorized. -> [Help 1] dkayiwa (Daniel Kayiwa) 2015-08-06 13:56:29 UTC #2 Did you check out the troubleshooting section at the bottom of this page? http://stackoverflow.com/questions/20570009/deploying-artifacts-in-nexus-from-maven-gives-error-return-code-is-401

Error Deploying Artifact Failed To Transfer File Return Code Is 400

That drives Maven crazy in some unpredicted ways (Maven good in that). up vote 50 down vote favorite 10 Why am I getting a "401 Unauthorized" error in Maven? So, shadowing central and snapshots in settings is the right way to go, but repositories in distributionManagement should be called differently. Checklist item 6.

Further details can be found here: https://issues.apache.org/jira/browse/WAGON-421 share|improve this answer edited Jun 8 '15 at 16:04 Robin Green 17.2k348118 answered Dec 3 '14 at 3:06 Grant Currey 211 add a comment| Code 503 - Service unavailable This is not thrown by Nexus but instead your reverse proxy. at org.apache.maven.artifact.deployer.DefaultArtifactDeployer.deploy(DefaultArtifactDeployer.java:143) at org.apache.maven.plugin.deploy.AbstractDeployMojo.deploy(AbstractDeployMojo.java:167) at org.apache.maven.plugin.deploy.DeployMojo.execute(DeployMojo.java:149) ... 21 more Caused by: org.eclipse.aether.deployment.DeploymentException: Failed to deploy artifacts: Could not transfer artifact com.github.aliteralmind:xbnjava:pom:0.1.2 from/to sonatype-nexus-staging (https://oss.sonatype.org/service/local/staging/deploy/maven2/): Failed to transfer file: https://oss.sonatype.org/service/local/staging/deploy/maven2/com/github/aliteralmind/xbnjava/0.1.2/xbnjava-0.1.2.pom. Failed To Deploy Artifacts Could Not Transfer Artifact Return Code Is 400 Reasonphrase Bad Request I've been taking a lot from SO recently, so I'm glad that I've been able to help someone else, your question has been the first time someone's accepted my answer! –John

Would someone help me? [ERROR] Failed to execute goal org.apache.maven.plugins:maven-deploy-plugin:2.7: deploy (default-deploy) on project my-test: Failed to deploy artifacts: Could no t transfer artifact org.bhavesh:my-test:jar:1.0-20140326.192116-1 from/to deploy ment (http://localhost:8081/nexus/content/repositories/snapshots/): Failed to Artifactory Return Code Is: 401, Reasonphrase: Unauthorized Does the file exist? –t0mppa Dec 13 '13 at 15:30 no, Its not uploaded to the nexus. Are the following topics usually in an introductory Complex Analysis class: Julia sets, Fatou sets, Mandelbrot set, etc? check here share|improve this answer answered Jan 28 '16 at 13:30 Alberto M 445522 1 Hint: many curl implementations require options to come before the URL.

You can check this by running mvn help:effective-settings. Maven Deploy Username Password share|improve this answer answered Dec 15 '13 at 0:04 Kelsey Francis 43137 add a comment| Your Answer draft saved draft discarded Sign up or log in Sign up using Google Do you think I am missing something? All rights reserved.

  1. Maven claims it connects to libs-snapshot-local as admin: sing connector WagonRepositoryConnector with priority 0 for http://192.168.1.16:8081/artifactory/libs-snapshot-local as admin But uploads the file as anonymous.
  2. You will get a 401 Unauthorized error if you supply the wrong credentials (password etc).
  3. I didn't think I made any changes, but obviously eliminating that -SNAPSHOT from the version was a bad thing. –aliteralmind Jul 18 '14 at 18:47 8 Why in the WORLD
  4. Yes, the releases work perfectly! :O 2013-12-27 13:21:58,941 [http-bio-8081-exec-8] [INFO ] (o.a.e.UploadServiceImpl:298) - Deploy to 'libs-release-local:sg/com/pinder/pinder/maven-metadata.xml.‌md5' Content-Length: 32 I can see the archive on the web app! –Eric Han Dec 27
  5. Return code is: 401, ReasonPhrase: Unauthorized. -> [Help 1] [ERROR] [ERROR] To see the full stack trace of the errors, re-run Maven with the -e switch. [ERROR] Re-run Maven using the
  6. All other trademarks are the property of their respective owners.
  7. Not the answer you're looking for?
  8. When i am running mvn deploy i am getting this error.
  9. Sonatype and Sonatype Nexus are trademarks of Sonatype, Inc.

Artifactory Return Code Is: 401, Reasonphrase: Unauthorized

Is there a reason why similar or the same musical instruments would develop? browse this site I don't know what "drop" means. Error Deploying Artifact Failed To Transfer File Return Code Is 400 When was today's radar measurement of the Earth-Sun distance made and by who? Return Code Is 401 Reasonphrase Unauthorized Nexus I wrote the question :) –aliteralmind Jul 18 '14 at 17:56 Great..

share|improve this answer answered Jan 8 '15 at 14:43 rwitzel 922713 This solved the problem for me using sonatype nexus 2.12. navigate here Any ideas? The project's settings: Checklist item 3. I does not make any changes to the installed nexus. Nexus Failed To Transfer File Return Code Is 401 Reasonphrase Unauthorized

Here's the error I'm getting when calling mvn deploy (full logs at the bottom): [INFO] BUILD FAILURE [ERROR] Failed to execute goal org.apache.maven.plugins:maven-deploy-plugin:2.7:deploy (default-deploy) on project xbnjava: Failed to deploy artifacts: Nexus is running on localhost:8080/nexus and i am able to login with default user/password. Easiest way to confirm is to work through the maven versions and run "mvn deploy" on your project. Check This Out See: https://docs.sonatype.org/display/Repository/How+To+Generate+PGP+Signatures+With+Maven --> release-sign-artifacts release true That's one big Maven problem out of the way.

Make sure you have configured a server in settings.xml and that the server id is identical to the distribution repository id in pom.xml. Error Deploying Artifact Failed To Transfer File Return Code Is 500 Home Categories FAQ/Guidelines Terms of Service Privacy Policy Powered by Discourse, best viewed with JavaScript enabled Log In Unable to deploy artifacts to Nexus Development nexus Tags: # mogoodrich (Mark Goodrich) Includes the third-party code listed here.

Why one shouldn't play the 6th string of an A chord on guitar?

So when you get a 401 on deploying artifacts to Nexus, you need to make sure you provide correct credentials. Return code is: 401 at org.apache.maven.lifecycle.internal.MojoExecutor.execute(MojoExecutor.java:217) at org.apache.maven.lifecycle.internal.MojoExecutor.execute(MojoExecutor.java:153) at org.apache.maven.lifecycle.internal.MojoExecutor.execute(MojoExecutor.java:145) at org.apache.maven.lifecycle.internal.LifecycleModuleBuilder.buildProject(LifecycleModuleBuilder.java:84) at org.apache.maven.lifecycle.internal.LifecycleModuleBuilder.buildProject(LifecycleModuleBuilder.java:59) at org.apache.maven.lifecycle.internal.LifecycleStarter.singleThreadedBuild(LifecycleStarter.java:183) at org.apache.maven.lifecycle.internal.LifecycleStarter.execute(LifecycleStarter.java:161) at org.apache.maven.DefaultMaven.doExecute(DefaultMaven.java:320) at org.apache.maven.DefaultMaven.execute(DefaultMaven.java:156) at org.apache.maven.cli.MavenCli.execute(MavenCli.java:537) at org.apache.maven.cli.MavenCli.doMain(MavenCli.java:196) at org.apache.maven.cli.MavenCli.main(MavenCli.java:141) at sun.reflect.NativeMethodAccessorImpl.invoke0(Native Method) They are a mix of personal and professional posts. Mng-4469 Browse other questions tagged maven nexus or ask your own question.

Is Nexus running? Having tried all the suggestions above and more without success I eventually found that it was a Jenkins setting that was in error. Posts Atom Posts Comments Atom Comments By Topic Development (105) Java (66) Software (58) Maven (29) Web (28) Personal (21) Spring (21) Technology (20) Mac (16) Plugin (15) Windows Mobile Phone this contact form Check the "deployment policy" in your hosted repository configuration.

You can check this by running mvn help:effective-settings. Return code is: 401 at org.apache.maven.wagon.providers.http.LightweightHttpWagon.finishPutTransfer(LightweightHttpWagon.java:205) I'm afraid it doesn't shed much light. another server has the same IP as the Nexus host and your reverse proxy is confused. How to tell my parents I want to marry my girlfriend Did Joseph Smith “translate the Book of Mormon”?

If the default bundle file isn't adequate, you can specify an alternate file using the --cacert option. at org.apache.maven.lifecycle.internal.MojoExecutor.execute(MojoExecutor.java:216) ---------------------------------------------------------------------------------------------------------- Here is POM.xml 4.0.0 org.bhavesh my-test 1.0-SNAPSHOT jar my-test http://maven.apache.org UTF-8 junit junit 3.8.1 test Return code is: 401 at org.sonatype.aether.impl.internal.DefaultDeployer.deploy(DefaultDeployer.java:280) at org.sonatype.aether.impl.internal.DefaultDeployer.deploy(DefaultDeployer.java:211) at org.sonatype.aether.impl.internal.DefaultRepositorySystem.deploy(DefaultRepositorySystem.java:443) at org.apache.maven.artifact.deployer.DefaultArtifactDeployer.deploy(DefaultArtifactDeployer.java:137) ... 23 more Caused by: org.sonatype.aether.transfer.ArtifactTransferException: Could not transfer artifact sg.com.pinder:pinder:jar:0.0.1-20131227.084815-1 from/to ServerA2 (http://192.168.1.16:8081/artifactory/libs-snapshot-local): Failed to transfer file: http://192.168.1.16:8081/artifactory/libs-snapshot-local/sg/com/pinder/pinder/0.0.1-SNAPSHOT/pinder-0.0.1-20131227.084815-1.jar. The most common reason is that you are trying to re-deploy an artifact into a repository which does not allow redeployment.

Code 402 - Payment Required This error is returned if you are using Nexus Professional and your license has expired. Pages Home Family George Tweet Share July 30, 2010 Maven/Nexus Failed to transfer file: Return code is: 401 If you ever get the following error Caused by: org.apache.maven.wagon.TransferFailedException: Failed to transfer Only 627 more to go. Check you Nexus logs for an explanation.

As mentioned already it should be the same as in section in settings.xml. Here is my POM. testproject testproject jar 1.0-SNAPSHOT testproject http://maven.apache.org releases http://localhost:8080/nexus/content/repositories/releases snapshots http://localhost:8080/nexus/content/repositories/snapshots ......... and ~/.m2/settings.xml snapshots deployment deployment123 Code 5xx - Other Errrors An exception was thrown in Nexus. Publishing to the remove Maven repository results in an authorization error: ~/java/sruth: gradle -q uploadArchives Uploading: path/to/jar/file to repository remote at https://hostname/path/to/repo Transferring 435K from remote FAILURE: Build failed with an

Either publish using a different version number, or delete the old artefact on the server and republish. I edited the question to reflect the changes already! Return code is: 401, ReasonPhrase: Unauthorized. -> [Help 1] org.apache.maven.lifecycle.LifecycleExecutionException: Failed to execute goal org.apache.maven.plugins:maven-deploy-plugin:2.7:deploy (default-deploy) on project my-test: Failed to deploy artifacts: Could not transfer artifact org.bhavesh:my-test:jar:1.0-20140328.195302-1 from/to deployment1 (http://localhost:8081/nexus/content/repositories/snapshots/): Checklist item 2.

I tried most of the things suggested by other similar questions like: trying setting the Maven Snapshot Version Behavior setting, snapshot tag in settings.xml.